Home > Google Chrome > Google Chrome Error 352

Google Chrome Error 352

If you are the web debugger, then try requesting any of the google product, there you can able to notice the word spdy given with short term of message. Windows Media Player Network Sharing Service Event 14365 Event 14365, Windows Media Player Network Sharing Service: Proximity detection failed due to unknown error '0x80004004'. Detailed Error [?] log n... Microsoft security essentials oobe stopped Session "Microsoft Security Essentials OOBE" stopped due to the following error:0xC000000D Log name :Microsoft-windows-Kernel-E... http://fileupster.com/google-chrome/google-chrome-error-6.html

Melde dich bei YouTube an, damit dein Feedback gezählt wird. Wargo helps you make the most of Cordova 4's major enhancements, while offering practical guidance for all versions, including Adobe PhoneGap. Wird geladen... Mein KontoSucheMapsYouTubePlayNewsGmailDriveKalenderGoogle+ÜbersetzerFotosMehrShoppingDocsBooksBloggerKontakteHangoutsNoch mehr von GoogleAnmeldenAusgeblendete FelderNach Gruppen oder Nachrichten suchen Troubleshooting Windows Errors And Solutions Gateway to Research online/computer errors and try to find solutions for the error. https://groups.google.com/d/topic/spdy-dev/HFjAbFRd-N0

Crashes Crashed report ID: How much crashed? Home About Event Source .3gp ( 1 ) .net framework ( 15 ) .net runtime 2.0 ( 1 ) .net runtime 4.0 ( 2 ) .net runtime optimization ( 1 ) Melde dich an, um unangemessene Inhalte zu melden. Comment 3 by [email protected], Aug 26 2015 Processing Crash ID 1c352ad154ef273e Crash ID 6ad93fd33ab75562 Comment 4 by [email protected], Aug 26 2015 Processing Crash ID 436cab8f88718688 Crash ID faaea217bc25fcd6 Comment 5 by

WargoAusgabeillustriertVerlagAddison-Wesley, 2015ISBN0134048199, 9780134048192Länge532 Seiten  Zitat exportierenBiBTeXEndNoteRefManÜber Google Books - Datenschutzerklärung - AllgemeineNutzungsbedingungen - Hinweise für Verlage - Problem melden - Hilfe - Sitemap - Google-Startseite Project: chromium ▼ Issues People Development process She writes two technical blogs pulling millions of visitors, and speaks about CSS3, HTML5, JavaScript and mobile web development at conferences around the world.Bibliografische InformationenTitelMobile HTML5Informatica (E-libro--2014/09)AutorEstelle WeylVerlag"O'Reilly Media, Inc.", 2013ISBN1491948892, Melde dich bei YouTube an, damit dein Feedback gezählt wird. ATTENTION: default value of option force_s3tc_enable overridden by environment. [429:429:0622/205830:ERROR:command_buffer_proxy_impl.cc(166)] Failed to initialize command buffer service. [3452:3452:0622/205831:FATAL:process_util_linux.cc(62)] Out of memory. [420:420:0622/205838:ERROR:command_buffer_proxy_impl.cc(161)] Could not send GpuCommandBufferMsg_Initialize.

Comment 16 by [email protected], Oct 5 2015 Processing Mergedinto: 539567 Status: Duplicate Comment 17 by [email protected], Oct 5 2015 Processing > Basically what we want is to reduce Chrome's file descriptor Wird verarbeitet... You can deliver a high-end user experience where it matters, while radically simplifying code maintenance and reuse. I think we've talked about this for years now.

Powered by Blogger. WargoKeine Leseprobe verfügbar - 2015Apache Cordova 3 programmingJohn M. Transkript Das interaktive Transkript konnte nicht geladen werden. It's easy!

Diese Funktion ist zurzeit nicht verfügbar. https://books.google.com/books?id=kjUFCAAAQBAJ&pg=PA516&lpg=PA516&dq=google+chrome+error+352&source=bl&ots=M0KUtA0XTG&sig=PAMZMeG8hiLSNwowwXdNSUaDq48&hl=en&sa=X&ved=0ahUKEwjb36TGyNnPAhXh64MKHaW3BOcQ6AEINTAE What can we do with 352, lets try searching for the solution. With this hands-on book, you’ll learn how to develop web apps that not only work on iOS, Android, Blackberry, and Windows Phone, but also perform well and provide...https://books.google.de/books/about/Mobile_HTML5.html?hl=de&id=StAWAgAAQBAJ&utm_source=gb-gplus-shareMobile HTML5Meine BücherHilfeErweiterte BuchsucheE-Book Durch die Nutzung unserer Dienste erklären Sie sich damit einverstanden, dass wir Cookies setzen.Mehr erfahrenOKMein KontoSucheMapsYouTubePlayNewsGmailDriveKalenderGoogle+ÜbersetzerFotosMehrShoppingDocsBooksBloggerKontakteHangoutsNoch mehr von GoogleAnmeldenAusgeblendete FelderBooksbooks.google.de - Using Apache Cordova 4, you can leverage native technologies and

Mein KontoSucheMapsYouTubePlayNewsGmailDriveKalenderGoogle+ÜbersetzerFotosMehrShoppingDocsBooksBloggerKontakteHangoutsNoch mehr von GoogleAnmeldenAusgeblendete FelderNach Gruppen oder Nachrichten suchen Um Google Groups Discussions nutzen zu können, aktivieren Sie JavaScript in Ihren Browsereinstellungen und aktualisieren Sie dann diese Seite. . this contact form Snapshot proof for the error: Related article: error 15 socket not connected chrome Posted by troubleshooterror at 11:12 AM Email This BlogThis! The webpage might be temporarily down or it may have moved permanently to a new web address. Very many tabs you need to open (more than 200) 3.

Trying default. [001:399] Started GoogleTalkPlugin, path=/opt/google/talkplugin/GoogleTalkPlugin [001:400] Waiting for GoogleTalkPlugin to start... [002:498] Attempting to connect to GoogleTalkPlugin... [002:498] Read port file, port=52715 [004:730] Starting client channel. [004:731] Read port file, On demonstration video I open three chrome windows full of tabs, and chrome begin very slow working. Du kannst diese Einstellung unten ändern. have a peek here I got the above error while try to access the gmail login page on the chrome...

All Activity Home TRiBot Bugs and Errors Site Bugs Fraudulent error? Melde dich an, um dieses Video zur Playlist "Später ansehen" hinzuzufügen. And pages begin blinking :( Did this work before?

Sprache: Deutsch Herkunft der Inhalte: Deutschland Eingeschränkter Modus: Aus Verlauf Hilfe Wird geladen...

Just like http, it is mainly used for web security and to reduce web page loading latency. Pages Home About Videos Event Viewer Windows 7 Network Application 26.3.12 Error 352 SPDY PING FAILED chrome Error message: Error 352 (net::ERR_SPDY_PING_FAILED): Unknown error. Security-SPP ERROR WINDOWS 7 Event 1017, Security-SPP: Installation of the Proof of Purchase failed . 0xC004F050 Partial Pkey=BBBBB ACID=? Screenshot from 2015-08-27 16-24-52.png 238 KB View Download Screenshot from 2015-08-27 16-25-20.png 148 KB View Download Comment 7 by [email protected], Aug 27 2015 Processing Cc: [email protected] Mergedinto: 368070 Status: Duplicate @amineer:

Learn more You're viewing YouTube in German. i hope you like and subcribe them Kategorie Bildung Lizenz Standard-YouTube-Lizenz Mehr anzeigen Weniger anzeigen Wird geladen... Event id 131 DeviceSetupManager Event 131, DeviceSetupManager: Metadata staging failed, result={00000000-0000-0000-FFFF-FFFFFFFFFFFF} for container '0x80072F78' ... Check This Out ATTENTION: default value of option force_s3tc_ Comment 2 by [email protected], Jun 27 2013 Processing Labels: nomedia Comment 3 by [email protected], Jan 6 2014 Processing Mergedinto: 260172 Status: Duplicate ► Sign in

solution: While troubleshooting any error two things are very important, they are the code and the error message. What is the expected behavior? I am obtaining the error 352 while trying to load the attachment on mail. Wird verarbeitet...

Whole browser Is it a problem with a plugin? IPS Theme by IPSFocus Theme Default Dashboard (Default) Contact Us Copyright © TRILEZ SOFTWARE INC. 2016 Community Software by Invision Power Services, Inc. × Existing user? size=3920000 [3076:3198:0923/112022:ERROR:crash_handler_host_linux.cc(372)] Failed to write crash dump for pid 3785 Cannot upload crash dump: failed to open Failed to create temporary file in /tmp: cannot upload crash dump Parent failed to MP Sample Submission MICROSOFT SECURITY ESSENTIALS Event Type mptelemetry,P1 8024402c,P2 endsearch,P3 search,P4 3.0.8107.0,P5 mpsigdwn.dll,P6 3.0.8107.0,P7 microsoft security essentials (e...

N/A Did this work before? Register a new account Sign in Already have an account? This message will be removed once you have signed in. Net Error 103/ 105 /106 /107 INTERNET connection Unable to connect to the internet : "Error 106 ( net::ERR_INTERNET_DISCONNECTED ): The internet connection has been lost" .

All rights reserved. For the past eight years, he has focused on mobile development and mobile development tools. We can find it by simply trying the action which causes the error and have a look at fiddler. Wird geladen...

Sign in here. Launch your Connect meeting in the add-in mode Problem#2 Users launch meeting in the Flash Player (launcher=false),  when clicking on the ‘Share My Screen’ button, users get an error “Adobe